supertux svn update

macbook-de-benjamin-leduc-2:supertux benjaminleduc$ svn update
D    version.h.cmake
A    test
A    test/sizef_test.cpp
A    test/md5_test.cpp
A    test/string_util_numeric_sort_test.txt
[…]
A    external/tinygettext/README
A    external/tinygettext/FindICONV.cmake
 U   external/tinygettext
Updated external to revision 184.
Updated to revision 6638.
macbook-de-benjamin-leduc-2:supertux benjaminleduc$ supertux2
-bash: supertux2: command not found
macbook-de-benjamin-leduc-2:supertux benjaminleduc$ ./supertux2
Warning: Couldn’t add ‘/usr/local/share/games/supertux2’ to physfs searchpath: File not found
[/Users/benjaminleduc/.supertux2] is in the search path
[/Users/benjaminleduc/supertux//data] is in the search path
Invalid button ‘0’ in buttonmap
Invalid button ‘1’ in buttonmap
Invalid axis ‘-2’ in axismap
Invalid axis ‘-1’ in axismap
Invalid axis ‘1’ in axismap
Invalid axis ‘2’ in axismap
new GL renderer
fullscreen  Window: 800×600 Fullscreen: 800×600 Area: 0x0
Warning: Couldn’t start level: Problem when reading level ‘levels/misc/menu.stl’: No images in tile.
Bus error
macbook-de-benjamin-leduc-2:supertux benjaminleduc$ mkdir build
mkdir: build: File exists
macbook-de-benjamin-leduc-2:supertux benjaminleduc$ cd build
macbook-de-benjamin-leduc-2:build benjaminleduc$ cmake ..
— The C compiler identification is GNU
— The CXX compiler identification is GNU
— Checking whether C compiler has -isysroot
— Checking whether C compiler has -isysroot – yes
— Checking whether CXX compiler has -isysroot
— Checking whether CXX compiler has -isysroot – yes
CMake Error at /opt/local/share/cmake-2.8/Modules/FindBoost.cmake:894 (message):
  Unable to find the requested Boost libraries.
  Unable to find the Boost header files.  Please set BOOST_ROOT to the root
  directory containing Boost or BOOST_INCLUDEDIR to the directory containing
  Boost’s headers.
Call Stack (most recent call first):
  CMakeLists.txt:65 (FIND_PACKAGE)
— Found OggVorbis: /usr/local/lib/libvorbisfile.dylib;/usr/local/lib/libvorbis.dylib;/usr/local/lib/libogg.dylib
— Size of void* is 4
— Found xgettext: /opt/local/bin/xgettext
CMake Error: The following variables are used in this project, but they are set to NOTFOUND.
Please set them or make sure they are set and tested correctly in the CMake files:
Boost_INCLUDE_DIR (ADVANCED)
   used as include directory in directory /Users/benjaminleduc/supertux
   used as include directory in directory /Users/benjaminleduc/supertux/external/squirrel
   used as include directory in directory /Users/benjaminleduc/supertux/tools/miniswig
GLEW_LIBRARY
    linked by target "supertux2" in directory /Users/benjaminleduc/supertux
— Configuring incomplete, errors occurred!
macbook-de-benjamin-leduc-2:build benjaminleduc$ cd ..
macbook-de-benjamin-leduc-2:supertux benjaminleduc$ mkdir build2
macbook-de-benjamin-leduc-2:supertux benjaminleduc$ cd build2
macbook-de-benjamin-leduc-2:build2 benjaminleduc$ cmake ..
— The C compiler identification is GNU
— The CXX compiler identification is GNU
— Checking whether C compiler has -isysroot
— Checking whether C compiler has -isysroot – yes
— Check for working C compiler: /usr/bin/gcc
— Check for working C compiler: /usr/bin/gcc — works
— Detecting C compiler ABI info
— Detecting C compiler ABI info – done
— Checking whether CXX compiler has -isysroot
— Checking whether CXX compiler has -isysroot – yes
— Check for working CXX compiler: /usr/bin/c++
— Check for working CXX compiler: /usr/bin/c++ — works
— Detecting CXX compiler ABI info
— Detecting CXX compiler ABI info – done
— Check if the system is big endian
— Searching 16 bit integer
— Looking for sys/types.h
— Looking for sys/types.h – found
— Looking for stdint.h
— Looking for stdint.h – found
— Looking for stddef.h
— Looking for stddef.h – found
— Check size of unsigned short
— Check size of unsigned short – done
— Using unsigned short
— Check if the system is big endian – little endian
CMake Error at /opt/local/share/cmake-2.8/Modules/FindBoost.cmake:894 (message):
  Unable to find the requested Boost libraries.
  Unable to find the Boost header files.  Please set BOOST_ROOT to the root
  directory containing Boost or BOOST_INCLUDEDIR to the directory containing
  Boost’s headers.
Call Stack (most recent call first):
  CMakeLists.txt:65 (FIND_PACKAGE)
— Looking for vorbis_bitrate_addblock in vorbis
— Looking for vorbis_bitrate_addblock in vorbis – found
— Found OggVorbis: /usr/local/lib/libvorbisfile.dylib;/usr/local/lib/libvorbis.dylib;/usr/local/lib/libogg.dylib
— Found CURL: /usr/lib/libcurl.dylib
— Performing Test HAVE_ICONV_CONST
— Performing Test HAVE_ICONV_CONST – Failed
— Check size of void*
— Check size of void* – done
— Size of void* is 4
CMake Error: The following variables are used in this project, but they are set to NOTFOUND.
Please set them or make sure they are set and tested correctly in the CMake files:
Boost_INCLUDE_DIR (ADVANCED)
   used as include directory in directory /Users/benjaminleduc/supertux
   used as include directory in directory /Users/benjaminleduc/supertux/external/squirrel
GLEW_LIBRARY
    linked by target "supertux2" in directory /Users/benjaminleduc/supertux
— Configuring incomplete, errors occurred!
macbook-de-benjamin-leduc-2:build2 benjaminleduc$ cmake -h
cmake version 2.8.0
Usage
  cmake [options] <path-to-source>
  cmake [options] <path-to-existing-build>
Options
  -C <initial-cache>          = Pre-load a script to populate the cache.
  -D <var>:<type>=<value>     = Create a cmake cache entry.
  -U <globbing_expr>          = Remove matching entries from CMake cache.
  -G <generator-name>         = Specify a makefile generator.
  -Wno-dev                    = Suppress developer warnings.
  -Wdev                       = Enable developer warnings.
  -E                          = CMake command mode.
  -i                          = Run in wizard mode.
  -L[A][H]                    = List non-advanced cached variables.
  –build <dir>               = Build a CMake-generated project binary tree.
  -N                          = View mode only.
  -P <file>                   = Process script mode.
  –graphviz=[file]           = Generate graphviz of dependencies.
  –system-information [file] = Dump information about this system.
  –debug-trycompile          = Do not delete the try compile directories..
  –debug-output              = Put cmake in a debug mode.
  –trace                     = Put cmake in trace mode.
  –help-command cmd [file]   = Print help for a single command and exit.
  –help-command-list [file]  = List available listfile commands and exit.
  –help-commands [file]      = Print help for all commands and exit.
  –help-compatcommands [file]= Print help for compatibility commands.
  –help-module module [file] = Print help for a single module and exit.
  –help-module-list [file]   = List available modules and exit.
  –help-modules [file]       = Print help for all modules and exit.
  –help-custom-modules [file]= Print help for all custom modules and exit.
  –help-policy cmp [file]    = Print help for a single policy and exit.
  –help-policies [file]      = Print help for all policies and exit.
  –help-property prop [file] = Print help for a single property and exit.
  –help-property-list [file] = List available properties and exit.
  –help-properties [file]    = Print help for all properties and exit.
  –help-variable var [file]  = Print help for a single variable and exit.
  –help-variable-list [file] = List documented variables and exit.
  –help-variables [file]     = Print help for all variables and exit.
  –copyright [file]          = Print the CMake copyright and exit.
  –help                      = Print usage information and exit.
  –help-full [file]          = Print full help and exit.
  –help-html [file]          = Print full help in HTML format.
  –help-man [file]           = Print full help as a UNIX man page and exit.
  –version [file]            = Show program name/version banner and exit.
Generators
The following generators are available on this platform:
  Unix Makefiles              = Generates standard UNIX makefiles.
  Xcode                       = Generate XCode project files.
  CodeBlocks – Unix Makefiles = Generates CodeBlocks project files.
  Eclipse CDT4 – Unix Makefiles
                              = Generates Eclipse CDT 4.0 project files.
  KDevelop3                   = Generates KDevelop 3 project files.
  KDevelop3 – Unix Makefiles  = Generates KDevelop 3 project files.
macbook-de-benjamin-leduc-2:build2 benjaminleduc$ cmake .. -debug-output
CMake Error: The source directory "/Users/benjaminleduc/supertux/build2/-debug-output" does not exist.
Specify –help for usage, or press the help button on the CMake GUI.
macbook-de-benjamin-leduc-2:build2 benjaminleduc$ cmake -debug-output ..
CMake Error at /opt/local/share/cmake-2.8/Modules/FindBoost.cmake:894 (message):
  Unable to find the requested Boost libraries.
  Unable to find the Boost header files.  Please set BOOST_ROOT to the root
  directory containing Boost or BOOST_INCLUDEDIR to the directory containing
  Boost’s headers.
Call Stack (most recent call first):
  CMakeLists.txt:65 (FIND_PACKAGE)
— Found OggVorbis: /usr/local/lib/libvorbisfile.dylib;/usr/local/lib/libvorbis.dylib;/usr/local/lib/libogg.dylib
— Size of void* is 4
CMake Error: The following variables are used in this project, but they are set to NOTFOUND.
Please set them or make sure they are set and tested correctly in the CMake files:
Boost_INCLUDE_DIR (ADVANCED)
   used as include directory in directory /Users/benjaminleduc/supertux
   used as include directory in directory /Users/benjaminleduc/supertux/external/squirrel
GLEW_LIBRARY
    linked by target "supertux2" in directory /Users/benjaminleduc/supertux
— Configuring incomplete, errors occurred!
macbook-de-benjamin-leduc-2:build2 benjaminleduc$ mkdir /opt/local/bin/portslocation/dports/glew
mkdir: /opt/local/bin/portslocation/dports/glew: Permission denied
macbook-de-benjamin-leduc-2:build2 benjaminleduc$ sudo mkdir /opt/local/bin/portslocation/dports/glew
Password:
macbook-de-benjamin-leduc-2:build2 benjaminleduc$ cd /opt/local/bin/portslocation/dports/glew
macbook-de-benjamin-leduc-2:glew benjaminleduc$ sudo port install glew
—>  Computing dependencies for glew
—>  Fetching glew
—>  Attempting to fetch glew-1.5.1-src.tgz from http://downloads.sourceforge.net/glew
—>  Verifying checksum(s) for glew
—>  Extracting glew
—>  Applying patches to glew
—>  Configuring glew
—>  Building glew
—>  Staging glew into destroot
—>  Installing glew @1.5.1_2
—>  Activating glew @1.5.1_2
—>  Cleaning glew
macbook-de-benjamin-leduc-2:glew benjaminleduc$ sudo mkdir /opt/local/bin/portslocation/dports/boost
macbook-de-benjamin-leduc-2:glew benjaminleduc$ cd /opt/local/bin/portslocation/dports/boost
macbook-de-benjamin-leduc-2:boost benjaminleduc$ sudo port install boost
—>  Computing dependencies for zlib
—>  Fetching zlib
—>  Attempting to fetch zlib-1.2.5.tar.bz2 from http://lil.fr.distfiles.macports.org/zlib
—>  Verifying checksum(s) for zlib
—>  Extracting zlib
—>  Applying patches to zlib
—>  Configuring zlib
—>  Building zlib
—>  Staging zlib into destroot
—>  Deactivating zlib @1.2.3_4
—>  Computing dependencies for zlib
—>  Installing zlib @1.2.5_0
—>  Activating zlib @1.2.5_0
—>  Cleaning zlib
—>  Computing dependencies for boost
—>  Fetching boost-jam
—>  Attempting to fetch boost-jam-3.1.17.tgz from http://lil.fr.distfiles.macports.org/boost-jam
—>  Verifying checksum(s) for boost-jam
—>  Extracting boost-jam
—>  Applying patches to boost-jam
—>  Configuring boost-jam
—>  Building boost-jam
—>  Staging boost-jam into destroot
—>  Installing boost-jam @3.1.17_0
—>  Activating boost-jam @3.1.17_0
—>  Cleaning boost-jam
—>  Fetching boost
—>  Attempting to fetch boost_1_42_0.tar.bz2 from http://lil.fr.distfiles.macports.org/boost
—>  Verifying checksum(s) for boost
—>  Extracting boost
—>  Applying patches to boost
—>  Configuring boost
—>  Building boost
—>  Staging boost into destroot
—>  Installing boost @1.42.0_0
—>  Activating boost @1.42.0_0
—>  Cleaning boost
macbook-de-benjamin-leduc-2:boost benjaminleduc$ 
macbook-de-benjamin-leduc-2:boost benjaminleduc$ 
macbook-de-benjamin-leduc-2:boost benjaminleduc$ cd /Users/benjaminleduc/supertux/build2
macbook-de-benjamin-leduc-2:build2 benjaminleduc$ cmake ..
— Boost version: 1.42.0
— Found the following Boost libraries:
— Found OggVorbis: /usr/local/lib/libvorbisfile.dylib;/usr/local/lib/libvorbis.dylib;/usr/local/lib/libogg.dylib
— Size of void* is 4
— Configuring done
— Generating done
— Build files have been written to: /Users/benjaminleduc/supertux/build2
macbook-de-benjamin-leduc-2:build2 benjaminleduc$ make
Scanning dependencies of target squirrel
[  0%] Building CXX object external/squirrel/CMakeFiles/squirrel.dir/squirrel/sqapi.cpp.o
[  0%] Building CXX object external/squirrel/CMakeFiles/squirrel.dir/squirrel/sqbaselib.cpp.o
[  1%] Building CXX object external/squirrel/CMakeFiles/squirrel.dir/squirrel/sqclass.cpp.o
[  1%] Building CXX object external/squirrel/CMakeFiles/squirrel.dir/squirrel/sqcompiler.cpp.o
[  1%] Building CXX object external/squirrel/CMakeFiles/squirrel.dir/squirrel/sqdebug.cpp.o
[  2%] Building CXX object external/squirrel/CMakeFiles/squirrel.dir/squirrel/sqfuncstate.cpp.o
[  2%] Building CXX object external/squirrel/CMakeFiles/squirrel.dir/squirrel/sqlexer.cpp.o
[  2%] Building CXX object external/squirrel/CMakeFiles/squirrel.dir/squirrel/sqmem.cpp.o
[  3%] Building CXX object external/squirrel/CMakeFiles/squirrel.dir/squirrel/sqobject.cpp.o
[  3%] Building CXX object external/squirrel/CMakeFiles/squirrel.dir/squirrel/sqstate.cpp.o
[  3%] Building CXX object external/squirrel/CMakeFiles/squirrel.dir/squirrel/sqtable.cpp.o
[  4%] Building CXX object external/squirrel/CMakeFiles/squirrel.dir/squirrel/sqvm.cpp.o
[  4%] Building CXX object external/squirrel/CMakeFiles/squirrel.dir/sqstdlib/sqstdaux.cpp.o
[  4%] Building CXX object external/squirrel/CMakeFiles/squirrel.dir/sqstdlib/sqstdblob.cpp.o
[  5%] Building CXX object external/squirrel/CMakeFiles/squirrel.dir/sqstdlib/sqstdio.cpp.o
[  5%] Building CXX object external/squirrel/CMakeFiles/squirrel.dir/sqstdlib/sqstdmath.cpp.o
[  5%] Building CXX object external/squirrel/CMakeFiles/squirrel.dir/sqstdlib/sqstdrex.cpp.o
[  6%] Building CXX object external/squirrel/CMakeFiles/squirrel.dir/sqstdlib/sqstdstream.cpp.o
[  6%] Building CXX object external/squirrel/CMakeFiles/squirrel.dir/sqstdlib/sqstdstring.cpp.o
[  6%] Building CXX object external/squirrel/CMakeFiles/squirrel.dir/sqstdlib/sqstdsystem.cpp.o
Linking CXX static library libsquirrel.a
[  6%] Built target squirrel
Scanning dependencies of target svnversion
[  6%] Updating /Users/benjaminleduc/supertux/build2/version.h…
[  7%] Built target svnversion
Scanning dependencies of target supertux2
[  8%] Building C object CMakeFiles/supertux2.dir/external/obstack/obstack.c.o
[  8%] Building C object CMakeFiles/supertux2.dir/external/findlocale/findlocale.c.o
/Users/benjaminleduc/supertux/external/findlocale/findlocale.c: In function ‘FL_FindLocale’:
/Users/benjaminleduc/supertux/external/findlocale/findlocale.c:419: warning: unused parameter ‘domain’
[  8%] Building CXX object CMakeFiles/supertux2.dir/src/main.cpp.o
[  9%] Building CXX object CMakeFiles/supertux2.dir/src/addon/addon.cpp.o
[  9%] Building CXX object CMakeFiles/supertux2.dir/src/addon/addon_manager.cpp.o
[  9%] Building CXX object CMakeFiles/supertux2.dir/src/addon/md5.cpp.o
[ 10%] Building CXX object CMakeFiles/supertux2.dir/src/audio/dummy_sound_source.cpp.o
[ 10%] Building CXX object CMakeFiles/supertux2.dir/src/audio/ogg_sound_file.cpp.o
[ 10%] Building CXX object CMakeFiles/supertux2.dir/src/audio/openal_sound_source.cpp.o
[ 11%] Building CXX object CMakeFiles/supertux2.dir/src/audio/sound_error.cpp.o
[ 11%] Building CXX object CMakeFiles/supertux2.dir/src/audio/sound_file.cpp.o
[ 11%] Building CXX object CMakeFiles/supertux2.dir/src/audio/sound_manager.cpp.o
[ 12%] Building CXX object CMakeFiles/supertux2.dir/src/audio/stream_sound_source.cpp.o
[ 12%] Building CXX object CMakeFiles/supertux2.dir/src/audio/wav_sound_file.cpp.o
[ 13%] Building CXX object CMakeFiles/supertux2.dir/src/badguy/angrystone.cpp.o
[ 13%] Building CXX object CMakeFiles/supertux2.dir/src/badguy/badguy.cpp.o
[ 13%] Building CXX object CMakeFiles/supertux2.dir/src/badguy/bomb.cpp.o
[ 14%] Building CXX object CMakeFiles/supertux2.dir/src/badguy/bouncing_snowball.cpp.o
[ 14%] Building CXX object CMakeFiles/supertux2.dir/src/badguy/captainsnowball.cpp.o
[ 14%] Building CXX object CMakeFiles/supertux2.dir/src/badguy/crystallo.cpp.o
[ 15%] Building CXX object CMakeFiles/supertux2.dir/src/badguy/dart.cpp.o
[ 15%] Building CXX object CMakeFiles/supertux2.dir/src/badguy/darttrap.cpp.o
[ 15%] Building CXX object CMakeFiles/supertux2.dir/src/badguy/dispenser.cpp.o
[ 16%] Building CXX object CMakeFiles/supertux2.dir/src/badguy/fish.cpp.o
[ 16%] Building CXX object CMakeFiles/supertux2.dir/src/badguy/flame.cpp.o
[ 16%] Building CXX object CMakeFiles/supertux2.dir/src/badguy/flyingsnowball.cpp.o
[ 17%] Building CXX object CMakeFiles/supertux2.dir/src/badguy/ghosttree.cpp.o
[ 17%] Building CXX object CMakeFiles/supertux2.dir/src/badguy/haywire.cpp.o
[ 17%] Building CXX object CMakeFiles/supertux2.dir/src/badguy/igel.cpp.o
[ 18%] Building CXX object CMakeFiles/supertux2.dir/src/badguy/jumpy.cpp.o
[ 18%] Building CXX object CMakeFiles/supertux2.dir/src/badguy/kamikazesnowball.cpp.o
[ 18%] Building CXX object CMakeFiles/supertux2.dir/src/badguy/kugelblitz.cpp.o
[ 19%] Building CXX object CMakeFiles/supertux2.dir/src/badguy/mole.cpp.o
[ 19%] Building CXX object CMakeFiles/supertux2.dir/src/badguy/mole_rock.cpp.o
[ 19%] Building CXX object CMakeFiles/supertux2.dir/src/badguy/mrbomb.cpp.o
[ 20%] Building CXX object CMakeFiles/supertux2.dir/src/badguy/mriceblock.cpp.o
[ 20%] Building CXX object CMakeFiles/supertux2.dir/src/badguy/mrtree.cpp.o
[ 20%] Building CXX object CMakeFiles/supertux2.dir/src/badguy/owl.cpp.o
[ 21%] Building CXX object CMakeFiles/supertux2.dir/src/badguy/plant.cpp.o
[ 21%] Building CXX object CMakeFiles/supertux2.dir/src/badguy/poisonivy.cpp.o
[ 21%] Building CXX object CMakeFiles/supertux2.dir/src/badguy/root.cpp.o
[ 22%] Building CXX object CMakeFiles/supertux2.dir/src/badguy/short_fuse.cpp.o
[ 22%] Building CXX object CMakeFiles/supertux2.dir/src/badguy/skullyhop.cpp.o
[ 22%] Building CXX object CMakeFiles/supertux2.dir/src/badguy/skydive.cpp.o
[ 23%] Building CXX object CMakeFiles/supertux2.dir/src/badguy/smartball.cpp.o
[ 23%] Building CXX object CMakeFiles/supertux2.dir/src/badguy/snail.cpp.o
[ 24%] Building CXX object CMakeFiles/supertux2.dir/src/badguy/snowball.cpp.o
[ 24%] Building CXX object CMakeFiles/supertux2.dir/src/badguy/snowman.cpp.o
[ 24%] Building CXX object CMakeFiles/supertux2.dir/src/badguy/spidermite.cpp.o
[ 25%] Building CXX object CMakeFiles/supertux2.dir/src/badguy/spiky.cpp.o
[ 25%] Building CXX object CMakeFiles/supertux2.dir/src/badguy/sspiky.cpp.o
[ 25%] Building CXX object CMakeFiles/supertux2.dir/src/badguy/stalactite.cpp.o
[ 26%] Building CXX object CMakeFiles/supertux2.dir/src/badguy/stumpy.cpp.o
[ 26%] Building CXX object CMakeFiles/supertux2.dir/src/badguy/toad.cpp.o
[ 26%] Building CXX object CMakeFiles/supertux2.dir/src/badguy/totem.cpp.o
[ 27%] Building CXX object CMakeFiles/supertux2.dir/src/badguy/treewillowisp.cpp.o
[ 27%] Building CXX object CMakeFiles/supertux2.dir/src/badguy/walking_badguy.cpp.o
[ 27%] Building CXX object CMakeFiles/supertux2.dir/src/badguy/walkingleaf.cpp.o
[ 28%] Building CXX object CMakeFiles/supertux2.dir/src/badguy/willowisp.cpp.o
[ 28%] Building CXX object CMakeFiles/supertux2.dir/src/badguy/yeti.cpp.o
[ 28%] Building CXX object CMakeFiles/supertux2.dir/src/badguy/yeti_stalactite.cpp.o
[ 29%] Building CXX object CMakeFiles/supertux2.dir/src/badguy/zeekling.cpp.o
[ 29%] Building CXX object CMakeFiles/supertux2.dir/src/control/codecontroller.cpp.o
[ 29%] Building CXX object CMakeFiles/supertux2.dir/src/control/controller.cpp.o
[ 30%] Building CXX object CMakeFiles/supertux2.dir/src/control/joystickkeyboardcontroller.cpp.o
/Users/benjaminleduc/supertux/src/util/gettext.hpp: In function ‘std::string _(const std::string&)’:
/Users/benjaminleduc/supertux/src/util/gettext.hpp:48: error: invalid use of undefined type ‘struct tinygettext::DictionaryManager’
/Users/benjaminleduc/supertux/src/supertux/globals.hpp:21: error: forward declaration of ‘struct tinygettext::DictionaryManager’
make[2]: *** [CMakeFiles/supertux2.dir/src/control/joystickkeyboardcontroller.cpp.o] Error 1
make[1]: *** [CMakeFiles/supertux2.dir/all] Error 2
make: *** [all] Error 2
macbook-de-benjamin-leduc-2:build2 benjaminleduc$ ls
CMakeCache.txt CPackConfig.cmake Makefile config.h version.h
CMakeFiles CPackSourceConfig.cmake cmake_install.cmake external
macbook-de-benjamin-leduc-2:build2 benjaminleduc$ cmake ..
— Found OggVorbis: /usr/local/lib/libvorbisfile.dylib;/usr/local/lib/libvorbis.dylib;/usr/local/lib/libogg.dylib
— Size of void* is 4
— Configuring done
— Generating done
— Build files have been written to: /Users/benjaminleduc/supertux/build2
macbook-de-benjamin-leduc-2:build2 benjaminleduc$ ls
CMakeCache.txt CPackConfig.cmake Makefile config.h version.h
CMakeFiles CPackSourceConfig.cmake cmake_install.cmake external
macbook-de-benjamin-leduc-2:build2 benjaminleduc$ make
[  6%] Built target squirrel
[  6%] Updating /Users/benjaminleduc/supertux/build2/version.h…
[  7%] Built target svnversion
[  8%] Building CXX object CMakeFiles/supertux2.dir/src/control/joystickkeyboardcontroller.cpp.o
/Users/benjaminleduc/supertux/src/util/gettext.hpp: In function ‘std::string _(const std::string&)’:
/Users/benjaminleduc/supertux/src/util/gettext.hpp:48: error: invalid use of undefined type ‘struct tinygettext::DictionaryManager’
/Users/benjaminleduc/supertux/src/supertux/globals.hpp:21: error: forward declaration of ‘struct tinygettext::DictionaryManager’
make[2]: *** [CMakeFiles/supertux2.dir/src/control/joystickkeyboardcontroller.cpp.o] Error 1
make[1]: *** [CMakeFiles/supertux2.dir/all] Error 2
make: *** [all] Error 2
macbook-de-benjamin-leduc-2:build2 benjaminleduc$ make -h
Usage: make [options] [target] …
Options:
  -b, -m                      Ignored for compatibility.
  -B, –always-make           Unconditionally make all targets.
  -C DIRECTORY, –directory=DIRECTORY
                              Change to DIRECTORY before doing anything.
  -d                          Print lots of debugging information.
  –debug[=FLAGS]             Print various types of debugging information.
  -e, –environment-overrides
                              Environment variables override makefiles.
  -f FILE, –file=FILE, –makefile=FILE
                              Read FILE as a makefile.
  -h, –help                  Print this message and exit.
  -i, –ignore-errors         Ignore errors from commands.
  -I DIRECTORY, –include-dir=DIRECTORY
                              Search DIRECTORY for included makefiles.
  -j [N], –jobs[=N]          Allow N jobs at once; infinite jobs with no arg.
  -k, –keep-going            Keep going when some targets can’t be made.
  -l [N], –load-average[=N], –max-load[=N]
                              Don’t start multiple jobs unless load is below N.
  -L, –check-symlink-times   Use the latest mtime between symlinks and target.
  -n, –just-print, –dry-run, –recon
                              Don’t actually run any commands; just print them.
  -o FILE, –old-file=FILE, –assume-old=FILE
                              Consider FILE to be very old and don’t remake it.
  -p, –print-data-base       Print make’s internal database.
  -q, –question              Run no commands; exit status says if up to date.
  -r, –no-builtin-rules      Disable the built-in implicit rules.
  -R, –no-builtin-variables  Disable the built-in variable settings.
  -s, –silent, –quiet       Don’t echo commands.
  -S, –no-keep-going, –stop
                              Turns off -k.
  -t, –touch                 Touch targets instead of remaking them.
  -v, –version               Print the version number of make and exit.
  -w, –print-directory       Print the current directory.
  –no-print-directory        Turn off -w, even if it was turned on implicitly.
  -W FILE, –what-if=FILE, –new-file=FILE, –assume-new=FILE
                              Consider FILE to be infinitely new.
  –warn-undefined-variables  Warn when an undefined variable is referenced.
  -N OPTION, –NeXT-option=OPTION
                              Turn on value of NeXT OPTION.
This program built for powerpc-apple-darwin9.0
Report bugs to <bug-make@gnu.org>

Publicités
Cet article a été publié dans Ordinateurs et Internet. Ajoutez ce permalien à vos favoris.

Un commentaire pour supertux svn update

  1. Anne-Sophie dit :

    c\’est quoi tout ce charabia? <Tu as voulu mettre qq chose sur ton blog?

Laisser un commentaire

Entrez vos coordonnées ci-dessous ou cliquez sur une icône pour vous connecter:

Logo WordPress.com

Vous commentez à l'aide de votre compte WordPress.com. Déconnexion / Changer )

Image Twitter

Vous commentez à l'aide de votre compte Twitter. Déconnexion / Changer )

Photo Facebook

Vous commentez à l'aide de votre compte Facebook. Déconnexion / Changer )

Photo Google+

Vous commentez à l'aide de votre compte Google+. Déconnexion / Changer )

Connexion à %s